RDF description of
primary topic: réductisols

réductisols
type: Concept
subject: Pedology @en
subject: Pédologie
definition: Solums dont le fonctionnement est dominé par l'existence de saturations par l'eau permanentes ou quasi permanentes. (Source : INRA)
in scheme: PLP
note: Selon la profondeur d'apparition des horizons réductiques et selon le régime hydrique, on distingue les Réductisols Typiques (à saturation permanente remontant saisonnièrement dans le solum suite aux fluctuations d'une nappe permanente profonde) et les Réductisols Stagniques (à saturation prolongée affectant l'horizon A - nappe perchée ou imbibition capillaire (Référentiel Pédologique 2007). (Source : INRA)
related: http://opendata.inrae.fr/PLP/508
related: http://opendata.inrae.fr/PLP/902
related: http://opendata.inrae.fr/PLP/784
related: http://opendata.inrae.fr/PLP/477
related: http://opendata.inrae.fr/PLP/58
related: http://opendata.inrae.fr/PLP/783
related: http://opendata.inrae.fr/PLP/412
related: http://opendata.inrae.fr/PLP/785
related: http://opendata.inrae.fr/PLP/669
related: http://opendata.inrae.fr/PLP/413
top concept of: PLP