RDF description of
primary topic: Références

Références
type: Concept
subject: Pedology @en
subject: Pédologie
definition: Catégories typologiques de plus haut niveau définies, le plus souvent, par des solums diagnostiques, c'est-à-dire par des séquences verticales d'horizons replacées dans leur pédopaysage (Référentiel Pédologique). (Source : INRA)
in scheme: PLP
note: Certaines Références sont définies par d'autres moyens: - par leur position basse dans le paysage et la nature de leur roche-mère (cas des fluviosols et des Colluviosols) ; - ou bien par des macrocaractères du solum, c'est-à-dire par des traits pédologiques ou des caractères qui affectent plusieurs horizons comme, par exemple, les fissures des vertisols ou bien la forte différenciation texturale et la transition brutale entre horizons des planosols. (Source : INRA)
preferred label: References @en
related: http://opendata.inrae.fr/PLP/928
related: http://opendata.inrae.fr/PLP/456
related: http://opendata.inrae.fr/PLP/687
related: http://opendata.inrae.fr/PLP/885
top concept of: PLP