RDF description of
primary topic: argiles micacées

argiles micacées
type: Concept
subject: Mineralogy @en
subject: Pedology @en
subject: Minéralogie
subject: Pédologie
definition: Minéraux argileux de la famille des illites, résultant de la microdivision de micas. (Source : INRA)
in scheme: PLP
preferred label: micaceous clays @en
related: http://opendata.inrae.fr/PLP/604
related: http://opendata.inrae.fr/PLP/615
related: http://opendata.inrae.fr/PLP/505
top concept of: PLP