régime hydrique d'un sol
type: Concept
subject: Pedology @en
subject: Pédologie
alternative label: soil water regime @en
alternative label: régime hydrique
alternative label: soil moisture regime @en
alternative label: économie en eau
definition: Capacités de rétention des différents horizons d'un sol et d'évacuation des excès d'eau par ruissellement, infiltration et percolation ou évapotranspiration au cours d'une période de temps, (année moyenne ou période pluriannuelle). (Source : INRA)
in scheme: PLP
note: Ces capacités sont sous la dépendance de facteurs extrinsèques (climat, pente) et de facteurs intrinsèques (granulométrie, structure, perméabilité). Le terme économie en eau est vieilli. (Source : INRA)
preferred label: water regime @en
related: http://opendata.inrae.fr/PLP/286
related: http://opendata.inrae.fr/PLP/285
related: http://opendata.inrae.fr/PLP/190
related: http://opendata.inrae.fr/PLP/679
top concept of: PLP

RDF description of
primary topic: régime hydrique d'un sol