RDF description of
primary topic: reliquat d'azote minéral

reliquat d'azote minéral
type: Concept
subject: Pedology @en
subject: Agronomie
subject: Pédologie
subject: Agronomy @en
definition: Quantité d'azote minéral présent dans un sol, à une profondeur donnée, à un moment donné (automne, hiver, après récolte, etc.). (Source : INRA)
in scheme: PLP
preferred label: residual inorganic nitrogen @en
top concept of: PLP