RDF description of
primary topic: remanié

remanié
type: Concept
subject: Pedology @en
subject: Pédologie
alternative label: reworked @en
definition: Qualifie un horizon ou un solum dont l'organisation initiale et naturelle en horizons a été nettement modifiée par des phénomènes naturels tels que les cryoturbations, les coulées boueuses, les glissements de terrain, les termites, ou par des actions de l'homme telles que les fouilles, les décapages, les nivellements, les transports et les dépôts de matériaux terreux (Source : INRA)
in scheme: PLP
note: Un échantillon de sol est dit remanié lorsque son organisation, telle qu'elle était in situ, n'a pas été conservée. (Source : INRA)
preferred label: disturbed @en
related: http://opendata.inrae.fr/PLP/299
top concept of: PLP