argileux
type: Concept
subject: Pedology @en
subject: Agronomie
subject: Pédologie
subject: Agronomy @en
definition: Qualifie un horizon, un sol, un matériau constitué surtout de particules argileuses, ce qui lui confère une plasticité et une forte capacité d'échange cationique. (Source : INRA)
in scheme: PLP
note: Ce terme doit être employé en référence à l'un des triangles de texture en usage. Bien distinguer les sols et horizons argileux issus de matériaux sédimentaires marins ou lacustres, souvent mal structurés, et peu perméables (voir : pélosols, planosols) des matériaux argileux issus de la décarbonatation totale de roches calcaires dures ou tendres. Ces derniers sont souvent très bien structurés et aérés et, de ce fait, s'avèrent perméables malgré des teneurs en argiles souvent très élevées. (Source : INRA)
preferred label: clayey @en
related: http://opendata.inrae.fr/PLP/74
related: http://opendata.inrae.fr/PLP/984
top concept of: PLP

RDF description of
primary topic: argileux