RDF description of
primary topic: représentativité

représentativité
type: Concept
subject: Pedology @en
subject: Pédologie
definition: Caractère de généralité d'un échantillon ou d'une observation par rapport à l'ensemble échantillonné ou observé (horizon, territoire, couverture pédologique). (Source : INRA)
in scheme: PLP
note: Pour des raisons d'économie de moyens, on s'efforce de diminuer le nombre de prélèvements ou d'observations et de faire en sorte que chacun d'entre eux représente le mieux possible l'ensemble. D'où l'importance du choix des lieux d'étude et de prélèvement (sondages, fosses) et également d'un découpage judicieux des solums en horizons, lesquels seront ensuite autant d'unités de description et d'échantillonnage. (Source : INRA)
preferred label: representativeness @en
related: http://opendata.inrae.fr/PLP/301
related: http://opendata.inrae.fr/PLP/752
related: http://opendata.inrae.fr/PLP/299
top concept of: PLP