réserve facilement utilisable
type: Concept
subject: Pedology @en
subject: Agronomie
subject: Pédologie
subject: Agronomy @en
alternative label: RFU
definition: Fraction de la réserve en eau la plus facilement accessible aux plantes. (Source : INRA)
in scheme: PLP
note: En fonction de la dimension des pores, il est certain que toute l'eau utile n'est pas aussi facilement utilisable par le végétal. Certains auteurs ont donc proposé la notion de réserve facilement utilisable. (Source : INRA)
preferred label: easily available water reserve @en
related: http://opendata.inrae.fr/PLP/805
related: http://opendata.inrae.fr/PLP/807
related: http://opendata.inrae.fr/PLP/152
top concept of: PLP

RDF description of
primary topic: réserve facilement utilisable