RDF description of
primary topic: résilience

résilience
type: Concept
subject: Pedology @en
subject: Pédologie
subject: Physics @en
subject: Physique
definition: Aptitude d'un système à revenir à son équilibre initial après une perturbation. (Source : INRA)
in scheme: PLP
note: Ce concept est appliqué aux sols dans le cas d'une contamination chimique ou d'une perturbation biologique majeure. (Source : INRA)
preferred label: resilience @en
top concept of: PLP