RDF description of
primary topic: ressuyage

ressuyage
type: Concept
subject: Pedology @en
subject: Agronomie
subject: Pédologie
subject: Agronomy @en
definition: Retour progressif et spontané d'un horizon ou d'un sol à un état d'humidité proche de la capacité au champ par percolation d'un excès d'eau gravitaire. (Source : INRA)
in scheme: PLP
preferred label: gravitational soil water movement @en
related: http://opendata.inrae.fr/PLP/696
top concept of: PLP