coats
type: Concept
subject: Pedology
subject: Pédologie @fr
alternative label: coatings
alternative label: clay skins
definition: Fines couches de n'importe quelle substance redistribuée couvrant les parois de vides, de particules, éléments grossiers inclus, ou d'agrégats. (Source : INRA) @fr
in scheme: PLP
note: Certains revêtements sont très petits et visibles seulement par l'examen de lames minces. Lorsqu'ils sont nombreux et généralisés, les revêtements argileux sont les meilleures preuves de la réalité et de l'importance du processus d'argilluviation. Ils caractérisent alors les horizons BT. (Source : INRA) @fr
preferred label: revêtements @fr
related: http://opendata.inrae.fr/PLP/507
related: http://opendata.inrae.fr/PLP/979
related: http://opendata.inrae.fr/PLP/73
related: http://opendata.inrae.fr/PLP/459
related: http://opendata.inrae.fr/PLP/239
related: http://opendata.inrae.fr/PLP/369
top concept of: PLP

RDF description of
primary topic: coats