risque
type: Concept
subject: Environnement
subject: Environment @en
definition: Probabilité d'un effet néfaste et de l'importance d'un tel effet résultant de la présence d'un danger. (Source : INRA)
in scheme: PLP
note: Pour qu'il y ait risque, il faut l'existence d'un danger et l'exposition d'un ou plusieurs organismes vivants à ce danger. L'ampleur du risque résulte de l'importance de l'exposition croisée avec l'intensité du danger. (Source : INRA)
preferred label: risk @en
related: http://opendata.inrae.fr/PLP/318
related: http://opendata.inrae.fr/PLP/353
related: http://opendata.inrae.fr/PLP/249
top concept of: PLP

RDF description of
primary topic: risque