argilluviation
type: Concept
subject: Pedology @en
subject: Pédologie
definition: Illuviation de particules argileuses. (Source : INRA)
in scheme: PLP
related: http://opendata.inrae.fr/PLP/507
related: http://opendata.inrae.fr/PLP/615
related: http://opendata.inrae.fr/PLP/521
related: http://opendata.inrae.fr/PLP/459
related: http://opendata.inrae.fr/PLP/515
top concept of: PLP

RDF description of
primary topic: argilluviation