RDF description of
primary topic: underlying rock

underlying rock
type: Concept
subject: Pedology
subject: Pédologie @fr
alternative label: underlying material
definition: Roche au sens large, non altérée, située sous le solum considéré et qui peut être soit le véritable matériau parental, soit un simple substrat. (Source : INRA) @fr
in scheme: PLP
preferred label: roche sous-jacente @fr
related: http://opendata.inrae.fr/PLP/926
related: http://opendata.inrae.fr/PLP/927
related: http://opendata.inrae.fr/PLP/592
top concept of: PLP