RDF description of
primary topic: fraction granulométrique sables

fraction granulométrique sables
type: Concept
subject: Pedology @en
subject: Sedimentology @en
subject: Sédimentologie
subject: Agronomie
subject: Pédologie
subject: Agronomy @en
definition: Ensemble des particules de dimensions comprises entre 50 et 2 000 µm. (Source : INRA)
in scheme: PLP
note: On distingue les sables fins (50 à 200 µm) et les sables grossiers (200 à 2 000 µm). (Source : INRA)
preferred label: sand fraction @en
related: http://opendata.inrae.fr/PLP/824
related: http://opendata.inrae.fr/PLP/825
related: http://opendata.inrae.fr/PLP/394
top concept of: PLP