RDF description of
primary topic: salinité

salinité
type: Concept
subject: Pedology @en
subject: Pédologie
definition: Quantité de sels solubles présents dans la solution du sol. (Source : INRA)
in scheme: PLP
note: Certains sels peu solubles sont sous la forme de cristaux ou d'efflorescences (cas du gypse) mais, le plus souvent, ils sont sous une forme dissoute, des anions et cations étant présents dans la solution du sol. Pour les extraire et déterminer la salinité deux méthodes de laboratoire sont utilisées. Dans les deux cas, la salinité est déterminée par la mesure de la conductivité électrique du liquide. Dans la première méthode, on cherche à se rapprocher de ce qui se passe dans le sol en place, tout en opérant en conditions standardisées. L'échantillon de sol préalablement séché est porté à sa limite de liquidité par malaxage avec de l'eau distillée (pâte saturée). La salinité globale de l'extrait de pâte saturée est déterminée par la mesure de la conductivité électrique. Sur ce même extrait, il est possible également de réaliser le dosage des anions et cations solubles : carbonates, bicarbonates, chlorures, sulfates, ainsi que Ca2+, Mg2+, K+ et Na+. La seconde méthode consiste à mélanger la terre sèche avec beaucoup d'eau pour obtenir de fortes dilutions. (Source : INRA)
preferred label: salinity @en
related: http://opendata.inrae.fr/PLP/881
related: http://opendata.inrae.fr/PLP/357
related: http://opendata.inrae.fr/PLP/882
related: http://opendata.inrae.fr/PLP/552
related: http://opendata.inrae.fr/PLP/211
related: http://opendata.inrae.fr/PLP/845
top concept of: PLP