RDF description of
primary topic: sédimorphe

sédimorphe
type: Concept
subject: Pedology @en
subject: Pédologie
alternative label: lithomorphe (ancien)
definition: Qualifie un planosol ou un Pélosol différencié dont la différenciation texturale est la conséquence de la nature complexe de la roche-mère (Référentiel Pédologique). (Source : INRA)
in scheme: PLP
preferred label: sedimorphic @en
related: http://opendata.inrae.fr/PLP/110
related: http://opendata.inrae.fr/PLP/277
top concept of: PLP