RDF description of
primary topic: ségrégations de manganèse

ségrégations de manganèse
type: Concept
subject: Pedology @en
subject: Pédologie
definition: Concentrations d'oxyhydroxydes de manganèse au sein d'un horizon sous la formes de taches, amas, films ou nodules. (Source : INRA)
in scheme: PLP
note: Ces concentrations résultent des phénomènes d'oxydoréduction : solubilisation initiale en milieu réducteur, puis transfert à une échelle centimétrique, enfin réoxydation, précipitation et immobilisation. (Source : INRA)
preferred label: manganese segregations @en
related: http://opendata.inrae.fr/PLP/587
top concept of: PLP