RDF description of
primary topic: sels solubles

sels solubles
type: Concept
subject: Pedology @en
subject: Pédologie
definition: Sels plus solubles que le gypse (CaSO4, 2H2O) dont le produit de solubilité log Ks à 25 °C est égal à -4,85. (Source : INRA)
in scheme: PLP
note: Il peut s'agir de sels chlorurés, sulfatés, bicarbonatés, carbonatés ou nitratés : sels simples KCl, NaCl, MgCl2, CaCl2, Na2SO4, MgSO4, NaHCO3, Na2CO3, NaNO3..., ou sels complexes plus ou moins hydratés. Ces sels sont caractéristiques des solums salsodiques. (Source : INRA)
preferred label: soluble salts @en
related: http://opendata.inrae.fr/PLP/881
related: http://opendata.inrae.fr/PLP/882
related: http://opendata.inrae.fr/PLP/830
related: http://opendata.inrae.fr/PLP/875
related: http://opendata.inrae.fr/PLP/832
top concept of: PLP