semelle de labour
type: Concept
subject: Agronomie
subject: Agronomy @en
alternative label: tillage pan @en
alternative label: plough sole @en
definition: Niveau compacté se formant à la longue à la base de l'horizon labouré lorsqu'on utilise des charrues à socs, et pouvant constituer un obstacle difficilement franchissable pour l'eau et les racines. (Source : INRA)
in scheme: PLP
note: Ce niveau, peu ou pas perméable, devient un plan de circulation préférentielle dans le sens de la pente pour les eaux ayant percolé à travers la couche travaillée. La destruction de cette semelle par éclatement est réalisée par sous-solage. (Source : INRA)
preferred label: plough pan @en
related: http://opendata.inrae.fr/PLP/892
related: http://opendata.inrae.fr/PLP/695
related: http://opendata.inrae.fr/PLP/654
related: http://opendata.inrae.fr/PLP/311
top concept of: PLP

RDF description of
primary topic: semelle de labour