sesquioxydes
type: Concept
subject: Geology @en
subject: Pedology @en
subject: Géologie
subject: Pédologie
definition: Oxydes métalliques trivalents de formule générale R2O3. (Source : INRA)
in scheme: PLP
note: Ce terme désigne indistinctement les oxydes de métaux les plus fréquents dans le sol (fer, aluminium, manganèse) ou leur mélange. (Source : INRA)
preferred label: sesquioxides @en
top concept of: PLP

RDF description of
primary topic: sesquioxydes