seuil d'investigation
type: Concept
subject: Pedology @en
subject: Pédologie
definition: Valeur de concentration en une substance potentiellement toxique ou en un élément polluant dans les matériaux pédologiques en place ou déplacés, définie par une réglementation et servant de seuil au-delà duquel une étude approfondie des dangers est obligatoire. (Source : INRA)
in scheme: PLP
note: Les valeurs des seuils d'investigation sont souvent modulées en fonction de l'utilisation effective ou potentielle du sol considéré. (Source : INRA)
preferred label: investigation threshold @en
related: http://opendata.inrae.fr/PLP/994
related: http://opendata.inrae.fr/PLP/995
top concept of: PLP

RDF description of
primary topic: seuil d'investigation