siallitisation
type: Concept
subject: Pedology @en
subject: Pédologie
definition: Type d'altération par hydrolyse partielle des minéraux aluminosilicatés au cours de laquelle une fraction de la silice libérée se recombine avec la totalité de l'aluminium libéré pour former de nouveaux minéraux argileux. (Source : INRA)
in scheme: PLP
preferred label: siallitization @en
related: http://opendata.inrae.fr/PLP/35
related: http://opendata.inrae.fr/PLP/620
related: http://opendata.inrae.fr/PLP/625
related: http://opendata.inrae.fr/PLP/116
top concept of: PLP

RDF description of
primary topic: siallitisation