RDF description of
primary topic: silcrètes

silcrètes
type: Concept
subject: Geology @en
subject: Pedology @en
subject: Géologie
subject: Pédologie
definition: Croûtes siliceuses ou horizons indurés cimentés par de la silice. (Source : INRA)
in scheme: PLP
note: Anglicisme. (Source : INRA)
preferred label: silcretes @en
top concept of: PLP