silice
type: Concept
subject: Geology @en
subject: Pedology @en
subject: Géologie
subject: Pédologie
alternative label: SiO2
definition: Oxyde de silicium, très abondant dans les sols, se présentant soit sous forme de grains de quartz (minéraux primaires), soit sous forme de fragments de silex ou chailles (éléments grossiers résiduels), soit sous la forme d'accumulations amorphes ou microcristallines, soit encore sous forme de gels. (Source : INRA)
in scheme: PLP
note: Ne pas confondre silicium, silice, quartz et silicate. (Source : INRA)
preferred label: silica @en
related: http://opendata.inrae.fr/PLP/480
related: http://opendata.inrae.fr/PLP/858
related: http://opendata.inrae.fr/PLP/628
related: http://opendata.inrae.fr/PLP/287
related: http://opendata.inrae.fr/PLP/400
related: http://opendata.inrae.fr/PLP/288
related: http://opendata.inrae.fr/PLP/710
related: http://opendata.inrae.fr/PLP/767
related: http://opendata.inrae.fr/PLP/856
top concept of: PLP

RDF description of
primary topic: silice