RDF description of
primary topic: assemblage

assemblage
type: Concept
subject: Micromorphology @en
subject: Pedology @en
subject: Pédologie
subject: Micromorphologie
definition: Disposition relative, à l'échelle microscopique, des différentes particules solides et des différents vides associés. (Source : INRA)
in scheme: PLP
note: L'"assemblage élémentaire" est l'assemblage du fond matriciel et des traits pédologiques qui lui sont inclus. (Source : INRA)
preferred label: fabric @en
related: http://opendata.inrae.fr/PLP/915
related: http://opendata.inrae.fr/PLP/663
top concept of: PLP