RDF description of
primary topic: assemblage élémentaire

assemblage élémentaire
type: Concept
subject: Micromorphology @en
subject: Pedology @en
subject: Pédologie
subject: Micromorphologie
definition: Assemblage du fond matriciel et des traits pédologiques qui lui sont inclus. (Source : INRA)
in scheme: PLP
preferred label: elementary fabric @en
top concept of: PLP