RDF description of
primary topic: silicification

silicification
type: Concept
subject: Geology
subject: Géologie @fr
definition: Imprégnation ou épigénie par de la silice (quartz, calcédoine, opale) d'une roche pré-existante, pouvant être liée à des phénomènes magmatiques et hydrothermaux, à des migrations de la silice dans certaines roches métamorphiques et à des précipitations de silice dans des roches sédimentaires. (Source : INRA) @fr
in scheme: PLP
top concept of: PLP