RDF description of
primary topic: sodicité

sodicité
type: Concept
subject: Pedology @en
subject: Pédologie
alternative label: sodivité
alternative label: exchangeable sodium percentage @en
definition: Quantité de sodium échangeable Na+ exprimée par rapport à la capacité d'échange cationique. (Source : INRA)
in scheme: PLP
note: Un horizon est dit sodique dès que le taux de sodium échangeable excède 15 % alors que la structure reste de type agrégée tandis que le pH demeure inférieur à 8,8. Un horizon est dit à alcali lorsque la sodicité dépasse 15 % et que la structure se dégrade, le pH excédant alors 8,8. (Source : INRA)
preferred label: sodicity @en
related: http://opendata.inrae.fr/PLP/882
related: http://opendata.inrae.fr/PLP/865
top concept of: PLP