RDF description of
primary topic: sodisation

sodisation
type: Concept
subject: Pedology @en
subject: Pédologie
alternative label: sodication @en
definition: Fixation de sodium sur le complexe adsorbant des sols. (Source : INRA)
in scheme: PLP
note: La sodisation se traduit souvent par une dégradation des propriétés physiques des horizons affectés (tendance à une structure massive donc à l'imperméabilisation). (Source : INRA)
preferred label: sodium fixation @en
top concept of: PLP