solifluxion
type: Concept
subject: Pedology @en
subject: Pédologie
subject: Géomorphologie
subject: Geomorphology @en
preferred label: solifluction
alternative label: cryoreptation
definition: Mouvement lent vers le bas des versants affectant dans son ensemble un matériau fin humide ayant franchi la limite de plasticité ou, plus souvent, de liquidité. (Source : INRA)
in scheme: PLP
related: http://opendata.inrae.fr/PLP/224
top concept of: PLP

RDF description of
primary topic: solifluxion