solods
type: Concept
subject: Pedology @en
subject: Pédologie
preferred label: soloth
definition: Terme ancien désignant un stade d'évolution très avancée d'un solonetz sous l'influence d'eaux douces. (Source : INRA)
in scheme: PLP
related: http://opendata.inrae.fr/PLP/882
related: http://opendata.inrae.fr/PLP/874
related: http://opendata.inrae.fr/PLP/876
related: http://opendata.inrae.fr/PLP/867
top concept of: PLP

RDF description of
primary topic: solods