RDF description of
primary topic: solonetz

solonetz
type: Concept
subject: Pedology @en
subject: Pédologie
definition: Sols sodiques montrant un lessivage des argiles sodiques et leur accumulation en profondeur dans un horizon à structure grossière prismatique ou columnaire. (Source : INRA)
in scheme: PLP
note: Terme russe ancien. Les solonetz constituent un groupe de sols de référence de la Base de référence mondiale pour les ressources en sols (WRB). Le pH, neutre en surface, peut atteindre 9 à 10 en profondeur. (Source : INRA)
related: http://opendata.inrae.fr/PLP/923
related: http://opendata.inrae.fr/PLP/882
related: http://opendata.inrae.fr/PLP/873
related: http://opendata.inrae.fr/PLP/875
related: http://opendata.inrae.fr/PLP/867
top concept of: PLP