RDF description of
primary topic: sols ferrugineux tropicaux

sols ferrugineux tropicaux
type: Concept
subject: Pedology @en
subject: Pédologie
definition: Sous-classe de la Classification française des sols caractérisée par la prédominance de la genèse, de l'individualisation, des migrations ou de la concentration des oxydes métalliques (fer et manganèse). (Source : INRA)
in scheme: PLP
note: Dans le Référentiel Pédologique 2007, ils sont traités dans le chapitre Ferruginosols. (Source : INRA)
preferred label: grey ferruginous soils @en
related: http://opendata.inrae.fr/PLP/1015
top concept of: PLP