RDF description of
primary topic: associations de sols

associations de sols
type: Concept
subject: Pedology @en
subject: Pédologie
definition: Unités cartographiques complexes permettant de rendre compte de certains aspects de la distribution des sols mais ne devant être employées comme catégories d'une légende de carte pédologique que lorsque l'échelle utilisée ne permet pas de faire apparaître à sa place chacune des unités simples. (Source : INRA)
in scheme: PLP
note: On distingue les juxtapositions, les séquences et les catenas. (Source : INRA)
preferred label: soil associations @en
related: http://opendata.inrae.fr/PLP/992
related: http://opendata.inrae.fr/PLP/993
related: http://opendata.inrae.fr/PLP/676
related: http://opendata.inrae.fr/PLP/535
top concept of: PLP