RDF description of
primary topic: sols polygonaux

sols polygonaux
type: Concept
subject: Pedology @en
subject: Pédologie
definition: Réorganisation, sous climats arctiques ou de hautes montagnes, de matériaux très peu altérés mais fortement désagrégés sous l'action de nombreux cycles gel/dégel ou sous l'influence de fortes dessiccations, sous la forme de réseaux de pentagones ou d'hexagones, parfois limités par un réseau de fentes en coin. (Source : INRA)
in scheme: PLP
note: La maille de ces réseaux varie de 10 cm à plusieurs décamètres de diamètre. Les pierres les plus grosses sont au centre et les particules les plus fines à l'extérieur ou le contraire. (Source : INRA)
preferred label: stone polygon soil @en
related: http://opendata.inrae.fr/PLP/364
related: http://opendata.inrae.fr/PLP/233
top concept of: PLP