RDF description of
primary topic: solubilisation

solubilisation
type: Concept
subject: Pedology
subject: Pédologie @fr
definition: Passage d'un état solide à un état soluble. (Source : INRA) @fr
in scheme: PLP
top concept of: PLP