RDF description of
primary topic: solution du sol

solution du sol
type: Concept
subject: Pedology @en
subject: Pédologie
definition: Eau occupant la porosité du sol, contenant divers éléments dissous (sels minéraux, matières organiques) mais également des fines particules en suspension, en équilibre dynamique avec les phases minérales plus ou moins altérées et les phases organiques. (Source : INRA)
in scheme: PLP
note: C'est dans la solution du sol que les racines puisent les éléments minéraux. Ses propriétés (pH, composition chimique en majeurs et traces) déterminent les phénomènes d'absorption (par les organismes vivants) et d'adsorption (sur les phases solides minérales et organiques). (Source : INRA)
preferred label: soil solution @en
related: http://opendata.inrae.fr/PLP/294
related: http://opendata.inrae.fr/PLP/111
related: http://opendata.inrae.fr/PLP/709
related: http://opendata.inrae.fr/PLP/90
top concept of: PLP