RDF description of
primary topic: soufre

soufre
type: Concept
subject: Geology @en
subject: Pedology @en
subject: Géologie
subject: Pédologie
alternative label: S
definition: Élément trace présent dans la croûte terrestre (teneur moyenne : 0,06 %) sous forme de sulfates (gypse) ou de sulfures. (Source : INRA)
in scheme: PLP
note: En agronomie, le soufre, élément nécessaire à l'élaboration des tissus des organismes vivants (acides aminés soufrés) est apporté en complément aux sols cultivés sous la forme de sulfates. Les retombées atmosphériques de soufre ne sont pas négligeables (5 à 10 kg/ha/an en zones rurales). Le soufre en poudre est également utilisé pour traiter directement le feuillage de certaines plantes (vignes) afin de lutter contre l'oïdium (soufrage). (Source : INRA)
note: Les sulfates ou les sulfures présent dans la croûte terrestre sont par exemple des minerais comme la pyrite FeS2, la blende ZnS, la galène PbS, le cinabre HgS, la stibine Sb2S3, le mispickel FeAsS, etc. Dans les marais maritimes des zones intertropicales, la pyrite présente dans les sédiments fins peut s'oxyder en acide sulfurique par réoxydation. (Source : INRA)
preferred label: sulphur @en
related: http://opendata.inrae.fr/PLP/319
related: http://opendata.inrae.fr/PLP/969
related: http://opendata.inrae.fr/PLP/320
related: http://opendata.inrae.fr/PLP/593
related: http://opendata.inrae.fr/PLP/588
related: http://opendata.inrae.fr/PLP/431
top concept of: PLP