RDF description of
primary topic: atteintes portées aux sols

atteintes portées aux sols
type: Concept
subject: Pedology @en
subject: Pédologie
definition: Formule utilisée par la législation suisse pour désigner les dommages pouvant affecter les sols. (Source : INRA)
in scheme: PLP
note: Cette législation distingue des atteintes chimiques (pollutions), physiques (érosion, tassements) et biologiques. (Source : INRA)
preferred label: damage to soils @en
top concept of: PLP