RDF description of
primary topic: underground

underground
type: Concept
subject: Agronomie @fr
subject: Agronomy
alternative label: subsurface
alternative label: subsoil
alternative label: basement
definition: Couche se trouvant sous la couche labourée et atteinte seulement par les instruments à action profonde. (Source : INRA) @fr
in scheme: PLP
note: Ce terme, bien que très utilisé également par les Anglo-Saxons, est à éviter car il est erroné et trompeur. On ne sait pas s'il désigne la partie inférieure du sol ou quelque chose situé sous le sol donc qui n'est plus du sol (une altérite, la roche sous-jacente). Les termes recommandés sont : horizons profonds ou horizons non situés en surface. (Source : INRA) @fr
preferred label: sous-sol @fr
related: http://opendata.inrae.fr/PLP/892
related: http://opendata.inrae.fr/PLP/478
top concept of: PLP