RDF description of
primary topic: splash

splash
type: Concept
subject: Pedology @en
subject: Agronomie
subject: Pédologie
subject: Agronomy @en
alternative label: rejaillissement
definition: Détachement de fines particules des agrégats situés à la surface du sol sous l'impact de grosses gouttes de pluie. (Source : INRA)
in scheme: PLP
note: Ces particules sont déplacées dans toutes les directions et peuvent participer à la formation progressive d'une croûte de battance. Ce terme est un anglicisme. (Source : INRA)
top concept of: PLP