RDF description of
primary topic: squelette

squelette
type: Concept
subject: Micromorphology @en
subject: Pedology @en
subject: Pédologie
subject: Micromorphologie
definition: Particules les plus grosses comme les sables et les limons grossiers, par opposition au plasma. (Source : INRA)
in scheme: PLP
note: Ce terme est utilisé en Suisse et en Allemagne pour désigner les éléments grossiers. (Source : INRA)
preferred label: skeleton @en
top concept of: PLP