RDF description of
primary topic: acidiphile

acidiphile
type: Concept
subject: Ecology @en
subject: Pedology @en
subject: Pédologie
subject: Écologie
definition: Qualifie une espèce végétale ou un groupement d'espèces qui tolère un sol acide. (Source : INRA)
in scheme: PLP
preferred label: acidophilous @en
related: http://opendata.inrae.fr/PLP/10
top concept of: PLP