RDF description of
primary topic: atténuation naturelle

atténuation naturelle
type: Concept
subject: Environnement
subject: Environment @en
definition: Diminution de l'exposition des organismes vivants à une substance potentiellement polluante via la solution du sol, suite à différents processus naturels géochimiques ou biochimiques (immobilisation, changement de spéciation, transferts vers la profondeur hors de portée des racines, etc.). (Source : INRA)
in scheme: PLP
preferred label: natural attenuation @en
related: http://opendata.inrae.fr/PLP/352
related: http://opendata.inrae.fr/PLP/509
related: http://opendata.inrae.fr/PLP/895
related: http://opendata.inrae.fr/PLP/886
top concept of: PLP