stabilité structurale
type: Concept
subject: Pedology @en
subject: Agronomie
subject: Pédologie
subject: Agronomy @en
definition: Aptitude d'un horizon à maintenir son état d'agrégation lors d'une agression par l'eau. (Source : INRA)
in scheme: PLP
note: La stabilité structurale est fonction de caractéristiques de constitution telles que composition granulométrique, abondance et nature des matières organiques, garniture cationique. En général cette notion ne s'applique qu'aux horizons de surface sous culture mais elle peut être appliquée également à des horizons profonds pour détecter d'éventuels matériaux à structure instable ou à des matériaux de remplissage de tranchées de drainage afin d'estimer la pérennité de l'effet tranchée. Dans la conception française, on s'efforce d'évaluer la stabilité intrinsèque des horizons testés, indépendamment de leur état structural et hydrique du moment. C'est pourquoi les conditions de désagrégation ont été standardisées au niveau le plus sévère. Les méthodes d'évaluation reposent sur la mise en ouvre d'une série de tests dont les résultats sont combinés dans un indice unique. (Source : INRA)
preferred label: structure stability @en
related: http://opendata.inrae.fr/PLP/102
related: http://opendata.inrae.fr/PLP/964
top concept of: PLP

RDF description of
primary topic: stabilité structurale