strate
type: Concept
subject: Pedology @en
subject: Pédologie
definition: Horizon ou regroupement de plusieurs horizons superposés, dans le cadre exclusivement du système DONESOL. (Source : INRA)
in scheme: PLP
note: Pour chaque strate, sont fournies des informations qualitatives (descriptions) et numériques (résultats analytiques) afin de caractériser une unité typologique de sol. (Source : INRA)
top concept of: PLP

RDF description of
primary topic: strate