stratégie d'échantillonnage
type: Concept
subject: Pedology @en
subject: Pédologie
definition: Manière d'organiser l'échantillonnage d'une couverture pédologique et particulièrement le choix de la localisation des sites et des profondeurs de prélèvements. (Source : INRA)
in scheme: PLP
note: Cette stratégie doit être adaptée à la complexité ou aux spécificités du territoire étudié et au problème à résoudre. Elle doit aussi être optimisée afin d'obtenir une information adéquate et aisément exploitable pour un coût acceptable. Le grid sampling (échantillonnage systématique selon une grille pré-établie) nécessite en général un trop grand nombre d'échantillons. L'échantillonnage stratifié, tenant compte des limites d'horizons et des séries de sols, est le plus souvent retenu en pédologie pour les grands territoires. (Source : INRA)
preferred label: soil sampling strategy @en
related: http://opendata.inrae.fr/PLP/848
related: http://opendata.inrae.fr/PLP/771
related: http://opendata.inrae.fr/PLP/301
top concept of: PLP

RDF description of
primary topic: stratégie d'échantillonnage