foliated structure
type: Concept
subject: Pedology
subject: Pédologie @fr
alternative label: laminated structure
definition: Type de structure développée à partir d'un matériel essentiellement végétal (horizons holorganiques) composée surtout de résidus organiques fibreux entremêlés (mousses, fougères). (Source : INRA) @fr
in scheme: PLP
preferred label: structure feuilletée @fr
related: http://opendata.inrae.fr/PLP/912
top concept of: PLP

RDF description of
primary topic: foliated structure